error compiling branch 1.3.0

Hi there.

when i try to build branch 1.3.0 do i get this error

# ./install
find . -name \*.gcno -o -name \*.gcda | xargs rm -f
find . -name \*.lo -o -name \*.o | xargs rm -f
find . -name \*.la -o -name \*.a | xargs rm -f
find . -name \*.so | xargs rm -f
find . -name .libs -a -type d|xargs rm -rf
rm -f libphp.la   modules/* libs/*
Cleaning..
Configuring for:
PHP Api Version:         20100412
Zend Module Api No:      20100525
Zend Extension Api No:   220100525
checking for grep that handles long lines and -e... /bin/grep
checking for egrep... /bin/grep -E
checking for a sed that does not truncate output... /bin/sed
checking whether the C compiler works... yes
checking for C compiler default output file name... a.out
checking for suffix of executables...
checking whether we are cross compiling... no
checking for suffix of object files... o
checking whether we are using the GNU C compiler... yes
checking whether gcc accepts -g... yes
checking for gcc option to accept ISO C89... none needed
checking how to run the C preprocessor... gcc -E
checking for icc... no
checking for suncc... no
checking whether gcc and cc understand -c and -o together... yes
checking for system library directory... lib
checking if compiler supports -R... no
checking if compiler supports -Wl,-rpath,... yes
checking build system type... x86_64-unknown-linux-gnu
checking host system type... x86_64-unknown-linux-gnu
checking target system type... x86_64-unknown-linux-gnu
checking for PHP prefix... /usr
checking for PHP includes... -I/usr/include/php5 -I/usr/include/php5/main -I/usr/include/php5/TSRM -I/usr/include/php5/Zend -I/usr/include/php5/ext -I/usr/include/php5/ext/date/lib
checking for PHP extension directory... /usr/lib/php5/20100525
checking for PHP installed headers prefix... /usr/include/php5
checking if debug is enabled... no
checking if zts is enabled... no
checking for re2c... no
configure: WARNING: You will need re2c 0.13.4 or later if you want to regenerate PHP parsers.
checking for gawk... no
checking for nawk... nawk
checking if nawk is broken... no
checking whether to enable phalcon framework... yes, shared
checking whether byte ordering is bigendian... no
checking for ext/igbinary/igbinary.h... no
checking whether HAVE_BUNDLED_PCRE is declared... no
checking whether HAVE_JSON is declared... yes
checking for ext/json/php_json.h... yes
checking whether HAVE_PHP_SESSION is declared... yes
checking for ext/session/php_session.h... yes
checking whether HAVE_HASH_EXT is declared... yes
checking for ext/hash/php_hash.h... yes
checking whether to include code coverage symbols... no
checking how to print strings... printf
checking for a sed that does not truncate output... (cached) /bin/sed
checking for fgrep... /bin/grep -F
checking for ld used by gcc... /usr/bin/ld
checking if the linker (/usr/bin/ld) is GNU ld... yes
checking for BSD- or MS-compatible name lister (nm)... /usr/bin/nm -B
checking the name lister (/usr/bin/nm -B) interface... BSD nm
checking whether ln -s works... yes
checking the maximum length of command line arguments... 1572864
checking whether the shell understands some XSI constructs... yes
checking whether the shell understands "+="... yes
checking how to convert x86_64-unknown-linux-gnu file names to x86_64-unknown-linux-gnu format... func_convert_file_noop
checking how to convert x86_64-unknown-linux-gnu file names to toolchain format... func_convert_file_noop
checking for /usr/bin/ld option to reload object files... -r
checking for objdump... objdump
checking how to recognize dependent libraries... pass_all
checking for dlltool... no
checking how to associate runtime and link libraries... printf %s\n
checking for ar... ar
checking for archiver @FILE support... @
checking for strip... strip
checking for ranlib... ranlib
checking for gawk... (cached) nawk
checking command to parse /usr/bin/nm -B output from gcc object... ok
checking for sysroot... no
checking for mt... mt
checking if mt is a manifest tool... no
checking for ANSI C header files... yes
checking for sys/types.h... yes
checking for sys/stat.h... yes
checking for stdlib.h... yes
checking for string.h... yes
checking for memory.h... yes
checking for strings.h... yes
checking for inttypes.h... yes
checking for stdint.h... yes
checking for unistd.h... yes
checking for dlfcn.h... yes
checking for objdir... .libs
checking if gcc supports -fno-rtti -fno-exceptions... no
checking for gcc option to produce PIC... -fPIC -DPIC
checking if gcc PIC flag -fPIC -DPIC works... yes
checking if gcc static flag -static works... yes
checking if gcc supports -c -o file.o... yes
checking if gcc supports -c -o file.o... (cached) yes
checking whether the gcc linker (/usr/bin/ld -m elf_x86_64) supports shared libraries... yes
checking whether -lc should be explicitly linked in... no
checking dynamic linker characteristics... GNU/Linux ld.so
checking how to hardcode library paths into programs... immediate
checking whether stripping libraries is possible... yes
checking if libtool supports shared libraries... yes
checking whether to build shared libraries... yes
checking whether to build static libraries... no
configure: creating ./config.status
config.status: creating config.h
config.status: executing libtool commands
/bin/bash /root/cphalcon/build/64bits/libtool --mode=compile gcc  -I. -I/root/cphalcon/build/64bits -DPHP_ATOM_INC -I/root/cphalcon/build/64bits/include -I/root/cphalcon/build/64bits/main -I/root/cphalcon/build/64bits -I/usr/include/php5 -I/usr/include/php5/main -I/usr/include/php5/TSRM -I/usr/include/php5/Zend -I/usr/include/php5/ext -I/usr/include/php5/ext/date/lib  -DPHALCON_RELEASE -DHAVE_CONFIG_H  -march=native -mtune=native -O2 -fno-delete-null-pointer-checks -finline-functions -fomit-frame-pointer -fno-builtin-memcmp -fvisibility=hidden   -c /root/cphalcon/build/64bits/phalcon.c -o phalcon.lo
libtool: compile:  gcc -I. -I/root/cphalcon/build/64bits -DPHP_ATOM_INC -I/root/cphalcon/build/64bits/include -I/root/cphalcon/build/64bits/main -I/root/cphalcon/build/64bits -I/usr/include/php5 -I/usr/include/php5/main -I/usr/include/php5/TSRM -I/usr/include/php5/Zend -I/usr/include/php5/ext -I/usr/include/php5/ext/date/lib -DPHALCON_RELEASE -DHAVE_CONFIG_H -march=native -mtune=native -O2 -fno-delete-null-pointer-checks -finline-functions -fomit-frame-pointer -fno-builtin-memcmp -fvisibility=hidden -c /root/cphalcon/build/64bits/phalcon.c  -fPIC -DPIC -o .libs/phalcon.o
/root/cphalcon/build/64bits/phalcon.c:7781:12: error: conflicting types for 'phalcon_preg_match'
/root/cphalcon/build/64bits/phalcon.c:2341:12: note: previous declaration of 'phalcon_preg_match' was here
/root/cphalcon/build/64bits/phalcon.c: In function 'zim_Phalcon_Debug_showTraceItem':
/root/cphalcon/build/64bits/phalcon.c:15115:3: warning: passing argument 2 of 'phalcon_preg_match' from incompatible pointer type [enabled by default]
/root/cphalcon/build/64bits/phalcon.c:7781:12: note: expected 'struct zval **' but argument is of type 'struct zval *'
/root/cphalcon/build/64bits/phalcon.c:15115:3: error: too few arguments to function 'phalcon_preg_match'
/root/cphalcon/build/64bits/phalcon.c:7781:12: note: declared here
/root/cphalcon/build/64bits/phalcon.c:15308:7: warning: passing argument 2 of 'phalcon_preg_match' from incompatible pointer type [enabled by default]
/root/cphalcon/build/64bits/phalcon.c:7781:12: note: expected 'struct zval **' but argument is of type 'struct zval *'
/root/cphalcon/build/64bits/phalcon.c:15308:7: error: too few arguments to function 'phalcon_preg_match'
/root/cphalcon/build/64bits/phalcon.c:7781:12: note: declared here
/root/cphalcon/build/64bits/phalcon.c: In function 'zim_Phalcon_Db_Result_Pdo_numRows':
/root/cphalcon/build/64bits/phalcon.c:30239:5: warning: passing argument 2 of 'phalcon_preg_match' from incompatible pointer type [enabled by default]
/root/cphalcon/build/64bits/phalcon.c:7781:12: note: expected 'struct zval **' but argument is of type 'struct zval *'
/root/cphalcon/build/64bits/phalcon.c:30239:5: error: too few arguments to function 'phalcon_preg_match'
/root/cphalcon/build/64bits/phalcon.c:7781:12: note: declared here
/root/cphalcon/build/64bits/phalcon.c: In function 'zim_Phalcon_Db_Adapter_Pdo_Mysql_describeColumns':
/root/cphalcon/build/64bits/phalcon.c:34234:4: warning: passing argument 2 of 'phalcon_preg_match' from incompatible pointer type [enabled by default]
/root/cphalcon/build/64bits/phalcon.c:7781:12: note: expected 'struct zval **' but argument is of type 'struct zval *'
/root/cphalcon/build/64bits/phalcon.c:34234:4: error: too few arguments to function 'phalcon_preg_match'
/root/cphalcon/build/64bits/phalcon.c:7781:12: note: declared here
/root/cphalcon/build/64bits/phalcon.c: In function 'zim_Phalcon_Db_Adapter_Pdo_Sqlite_describeColumns':
/root/cphalcon/build/64bits/phalcon.c:35081:4: warning: passing argument 2 of 'phalcon_preg_match' from incompatible pointer type [enabled by default]
/root/cphalcon/build/64bits/phalcon.c:7781:12: note: expected 'struct zval **' but argument is of type 'struct zval *'
/root/cphalcon/build/64bits/phalcon.c:35081:4: error: too few arguments to function 'phalcon_preg_match'
/root/cphalcon/build/64bits/phalcon.c:7781:12: note: declared here
/root/cphalcon/build/64bits/phalcon.c: In function 'zim_Phalcon_Validation_Validator_Regex_validate':
/root/cphalcon/build/64bits/phalcon.c:46714:2: warning: passing argument 2 of 'phalcon_preg_match' from incompatible pointer type [enabled by default]
/root/cphalcon/build/64bits/phalcon.c:7781:12: note: expected 'struct zval **' but argument is of type 'struct zval *'
/root/cphalcon/build/64bits/phalcon.c:46714:2: error: too few arguments to function 'phalcon_preg_match'
/root/cphalcon/build/64bits/phalcon.c:7781:12: note: declared here
/root/cphalcon/build/64bits/phalcon.c: In function 'zim_Phalcon_Mvc_Router_handle':
/root/cphalcon/build/64bits/phalcon.c:56455:5: warning: passing argument 2 of 'phalcon_preg_match' from incompatible pointer type [enabled by default]
/root/cphalcon/build/64bits/phalcon.c:7781:12: note: expected 'struct zval **' but argument is of type 'struct zval *'
/root/cphalcon/build/64bits/phalcon.c:56455:5: error: too few arguments to function 'phalcon_preg_match'
/root/cphalcon/build/64bits/phalcon.c:7781:12: note: declared here
/root/cphalcon/build/64bits/phalcon.c:56471:4: warning: passing argument 2 of 'phalcon_preg_match' from incompatible pointer type [enabled by default]
/root/cphalcon/build/64bits/phalcon.c:7781:12: note: expected 'struct zval **' but argument is of type 'struct zval *'
/root/cphalcon/build/64bits/phalcon.c:56471:4: error: too few arguments to function 'phalcon_preg_match'
/root/cphalcon/build/64bits/phalcon.c:7781:12: note: declared here
/root/cphalcon/build/64bits/phalcon.c: In function 'zim_Phalcon_Mvc_Model_Validator_Email_validate':
/root/cphalcon/build/64bits/phalcon.c:78503:2: warning: passing argument 2 of 'phalcon_preg_match' from incompatible pointer type [enabled by default]
/root/cphalcon/build/64bits/phalcon.c:7781:12: note: expected 'struct zval **' but argument is of type 'struct zval *'
/root/cphalcon/build/64bits/phalcon.c:78503:2: error: too few arguments to function 'phalcon_preg_match'
/root/cphalcon/build/64bits/phalcon.c:7781:12: note: declared here
/root/cphalcon/build/64bits/phalcon.c: In function 'zim_Phalcon_Mvc_Model_Validator_Regex_validate':
/root/cphalcon/build/64bits/phalcon.c:78985:2: warning: passing argument 2 of 'phalcon_preg_match' from incompatible pointer type [enabled by default]
/root/cphalcon/build/64bits/phalcon.c:7781:12: note: expected 'struct zval **' but argument is of type 'struct zval *'
/root/cphalcon/build/64bits/phalcon.c:78985:2: error: too few arguments to function 'phalcon_preg_match'
/root/cphalcon/build/64bits/phalcon.c:7781:12: note: declared here
/root/cphalcon/build/64bits/phalcon.c: In function 'zim_Phalcon_Image_Adapter_GD_check':
/root/cphalcon/build/64bits/phalcon.c:98436:4: warning: passing argument 2 of 'phalcon_preg_match' from incompatible pointer type [enabled by default]
/root/cphalcon/build/64bits/phalcon.c:7781:12: note: expected 'struct zval **' but argument is of type 'struct zval *'
/root/cphalcon/build/64bits/phalcon.c:98436:4: error: too few arguments to function 'phalcon_preg_match'
/root/cphalcon/build/64bits/phalcon.c:7781:12: note: declared here
make: *** [phalcon.lo] Error 1
[email protected] ~/cphalcon/build #

any clue?



1.9k

I posted the same thing earlier today, and also spotted the same question asked by someone else on StackOverflow recently.

http://forum.phalconphp.com/discussion/1460/1-3-0-install-problem



14.1k

oh i'm sorry then :)



84.5k

Could you please try compiling from ext?

cd cphalcon
cd ext
sudo ./install


14.1k

oh i see it doesn't get the whole thing :S

here is the whole thing. http://pastebin.com/wDQWQh2d