make: *** [phalcon.lo] Error 1 Centos 6.5 (64BITS)

libtool: compile: gcc -I. -I/root/cphalcon/build/64bits -DPHPATOMINC -I/root/cphalcon/build/64bits/include -I/root/cphalcon/build/64bits/main -I/root/cphalcon/build/64bits -I/usr/include/php -I/usr/include/php/main -I/usr/include/php/TSRM -I/usr/include/php/Zend -I/usr/include/php/ext -I/usr/include/php/ext/date/lib -DPHALCONRELEASE -DHAVECONFIGH -march=native -mtune=native -O2 -finline-functions -fomit-frame-pointer -fvisibility=hidden -c /root/cphalcon/build/64bits/phalcon.zep.c -fPIC -DPIC -o .libs/phalcon.o /root/cphalcon/build/64bits/phalcon.zep.c: In function ‘zephirfetchstaticpropertyce’: /root/cphalcon/build/64bits/phalcon.zep.c:6559: warning: passing argument 2 of ‘zendreadstaticproperty’ discards qualifiers from pointer target type /usr/include/php/Zend/zendAPI.h:321: note: expected ‘char *’ but argument is of type ‘const char *’ /root/cphalcon/build/64bits/phalcon.zep.c: In function ‘zephirupdatestaticpropertyex’: /root/cphalcon/build/64bits/phalcon.zep.c:6669: warning: passing argument 2 of ‘zendstdgetstaticproperty’ discards qualifiers from pointer target type /usr/include/php/Zend/zendobjecthandlers.h:147: note: expected ‘char *’ but argument is of type ‘const char *’ /root/cphalcon/build/64bits/phalcon.zep.c: At top level: /root/cphalcon/build/64bits/phalcon.zep.c:126687: error: ‘ZENDFE_END’ undeclared here (not in a function) make: * [phalcon.lo] Error 1

Help me...

edited Apr '15

Are you using PHP 5.3.3?, I think this version is no longer supported

Configuring for: PHP Api Version: 20090626 Zend Module Api No: 20090626 Zend Extension Api No: 220090626 checking for grep that handles long lines and -e... /bin/grep checking for egrep... /bin/grep -E checking for a sed that does not truncate output... /bin/sed checking for C compiler default output file name... a.out checking whether the C compiler works... yes checking whether we are cross compiling... no checking for suffix of executables... checking for suffix of object files... o checking whether we are using the GNU C compiler... yes checking whether gcc accepts -g... yes checking for gcc option to accept ISO C89... none needed checking how to run the C preprocessor... gcc -E checking for icc... no checking for suncc... no checking whether gcc and cc understand -c and -o together... yes checking for system library directory... lib checking if compiler supports -R... no checking if compiler supports -Wl,-rpath,... yes checking build system type... x8664-unknown-linux-gnu checking host system type... x8664-unknown-linux-gnu checking target system type... x8664-unknown-linux-gnu checking for PHP prefix... /usr checking for PHP includes... -I/usr/include/php -I/usr/include/php/main -I/usr/include/php/TSRM -I/usr/include/php/Zend -I/usr/include/php/ext -I/usr/include/php/ext/date/lib checking for PHP extension directory... /usr/lib64/php/modules checking for PHP installed headers prefix... /usr/include/php checking if debug is enabled... no checking if zts is enabled... no checking for re2c... no configure: WARNING: You will need re2c 0.13.4 or later if you want to regenerate PHP parsers. checking for gawk... gawk checking whether to enable phalcon... yes, shared checking whether HAVEBUNDLEDPCRE is declared... no checking whether HAVEJSON is declared... yes checking for ext/json/phpjson.h... yes checking for a sed that does not truncate output... (cached) /bin/sed checking for fgrep... /bin/grep -F checking for ld used by gcc... /usr/bin/ld checking if the linker (/usr/bin/ld) is GNU ld... yes checking for BSD- or MS-compatible name lister (nm)... /usr/bin/nm -B checking the name lister (/usr/bin/nm -B) interface... BSD nm checking whether ln -s works... yes checking the maximum length of command line arguments... 1966080 checking whether the shell understands some XSI constructs... yes checking whether the shell understands "+="... yes checking for /usr/bin/ld option to reload object files... -r checking for objdump... objdump checking how to recognize dependent libraries... passall checking for ar... ar checking for strip... strip checking for ranlib... ranlib checking command to parse /usr/bin/nm -B output from gcc object... ok checking for ANSI C header files... yes checking for sys/types.h... yes checking for sys/stat.h... yes checking for stdlib.h... yes checking for string.h... yes checking for memory.h... yes checking for strings.h... yes checking for inttypes.h... yes checking for stdint.h... yes checking for unistd.h... yes checking for dlfcn.h... yes checking for objdir... .libs checking if gcc supports -fno-rtti -fno-exceptions... no checking for gcc option to produce PIC... -fPIC -DPIC checking if gcc PIC flag -fPIC -DPIC works... yes checking if gcc static flag -static works... no checking if gcc supports -c -o file.o... yes checking if gcc supports -c -o file.o... (cached) yes checking whether the gcc linker (/usr/bin/ld -m elfx8664) supports shared libraries... yes checking whether -lc should be explicitly linked in... no checking dynamic linker characteristics... GNU/Linux ld.so checking how to hardcode library paths into programs... immediate checking whether stripping libraries is possible... yes checking if libtool supports shared libraries... yes checking whether to build shared libraries... yes checking whether to build static libraries... no configure: creating ./config.status config.status: creating config.h config.status: executing libtool commands /bin/sh /cphalcon/build/64bits/libtool --mode=compile gcc -I. -I/cphalcon/build/64bits -DPHPATOMINC -I/cphalcon/build/64bits/include -I/cphalcon/build/64bits/main -I/cphalcon/build/64bits -I/usr/include/php -I/usr/include/php/main -I/usr/include/php/TSRM -I/usr/include/php/Zend -I/usr/include/php/ext -I/usr/include/php/ext/date/lib -DPHALCONRELEASE -DHAVECONFIGH -march=native -mtune=native -O2 -finline-functions -fomit-frame-pointer -fvisibility=hidden -c /cphalcon/build/64bits/phalcon.zep.c -o phalcon.lo libtool: compile: gcc -I. -I/cphalcon/build/64bits -DPHPATOMINC -I/cphalcon/build/64bits/include -I/cphalcon/build/64bits/main -I/cphalcon/build/64bits -I/usr/include/php -I/usr/include/php/main -I/usr/include/php/TSRM -I/usr/include/php/Zend -I/usr/include/php/ext -I/usr/include/php/ext/date/lib -DPHALCONRELEASE -DHAVECONFIGH -march=native -mtune=native -O2 -finline-functions -fomit-frame-pointer -fvisibility=hidden -c /cphalcon/build/64bits/phalcon.zep.c -fPIC -DPIC -o .libs/phalcon.o /cphalcon/build/64bits/phalcon.zep.c: In function ‘zephirfetchstaticpropertyce’: /cphalcon/build/64bits/phalcon.zep.c:6559: warning: passing argument 2 of ‘zendreadstaticproperty’ discards qualifiers from pointer target type /usr/include/php/Zend/zendAPI.h:321: note: expected ‘char ’ but argument is of type ‘const char *’ /cphalcon/build/64bits/phalcon.zep.c: In function ‘zephir_update_static_property_ex’: /cphalcon/build/64bits/phalcon.zep.c:6669: warning: passing argument 2 of ‘zend_std_get_static_property’ discards qualifiers from pointer target type /usr/include/php/Zend/zend_object_handlers.h:147: note: expected ‘char *’ but argument is of type ‘const char *’ /cphalcon/build/64bits/phalcon.zep.c: At top level: /cphalcon/build/64bits/phalcon.zep.c:126687: error: ‘ZEND_FE_END’ undeclared here (not in a function) make: ** [phalcon.lo] Error 1



35.6k

Hey man

You need to generator code c, try to that

cd cphalcon/ext
make clean
 phpize
./configuration
 make && sudo make install

PHP 5.3.3 is not longer supported

gcc: Internal error: Killed (program cc1) Please submit a full bug report. See <http://bugzilla.redhat.com/bugzilla> for instructions.

My server memory is only 512M, php version is 5.5.7

edited May '15

I installed a success ,Linux compiler installation phalcon (512M memory) 1. sudo yum install php-devel pcre-devel gcc make 2. git clone --depth=1 git://github.com/phalcon/cphalcon.git 3. cd cphalcon/ext 4. /opt/local/php5/bin/phpize 5. ./configure --with-php-config=/opt/local/php5/bin/php-config 6. make && make install 7. vim /opt/local/php5/etc/php.ini 8. add a row extension=phalcon.so

edited Jun '15

Solution for ubuntu 12.04 with 512 MB RAM php 5.6. All comand from root

  1. git clone --depth 1 --branch phalcon-v2.0.3 https://github.com/phalcon/cphalcon.git
  2. cd cphalcon/ext
  3. phpize
  4. ./configure --with-php-config=/usr/bin/php-config
  5. make && make install
  6. touch /etc/php5/mods-available/phalcon.ini
  7. echo -e "extension=phalcon.so" >> /etc/php5/mods-available/phalcon.ini
  8. ln -s /etc/php5/mods-available/phalcon.ini /etc/php5/apache2/conf.d/100-phalcon.ini
  9. ln -s /etc/php5/mods-available/phalcon.ini /etc/php5/cli/conf.d/100-phalcon.ini
edited Sep '15

I get some error when practice step 4

./configure --with-php-config=/usr/bin/php-config

3checking for grep that handles long lines and -e... /bin/grep

checking for egrep... /bin/grep -E

checking for a sed that does not truncate output... /bin/sed

checking for cc... cc

checking for C compiler default output file name...

configure: error: in `/root/cphalcon/ext':

configure: error: C compiler cannot create executables

See `config.log' for more details.

I get some error when practice step 4

./configure --with-php-config=/usr/bin/php-config

3checking for grep that handles long lines and -e... /bin/grep

checking for egrep... /bin/grep -E

checking for a sed that does not truncate output... /bin/sed

checking for cc... cc

checking for C compiler default output file name...

configure: error: in `/root/cphalcon/ext':

configure: error: C compiler cannot create executables

See `config.log' for more details.

Did you see what is in config.log?